prefix
comment: Used in BCP47 recommendation, to indicate which subtags are valid for a certain variant

Variant Taxonomy
type: Named individual
type: ConceptScheme
has top concept: Pinyin romanization

Pinyin romanization
type: Named individual
type: Concept
type: Variant
issued: 2008-10-14
prefix: zh-Latn
prefix: bo-Latn
IANA subtag: pinyin
in scheme: Variant Taxonomy
top concept of: Variant Taxonomy

Variant
type: Class

IANA subtag
comment: Used in BCP47 recommendation for the subtag of a language, script, region or variant

Named individual
type: Class