prefix
comment: Used in BCP47 recommendation, to indicate which subtags are valid for a certain variant

Epic Sanskrit
prefix: sa
IANA subtag: itihasa
top concept of: Variant Taxonomy
issued: 2010-07-28
in scheme: Variant Taxonomy
type: Variant
type: Named individual
type: Concept

Variant Taxonomy
type: Named individual
type: ConceptScheme
has top concept: Epic Sanskrit

IANA subtag
comment: Used in BCP47 recommendation for the subtag of a language, script, region or variant

Named individual
type: Class

Variant
type: Class