prefix
comment: Used in BCP47 recommendation, to indicate which subtags are valid for a certain variant

Variant Taxonomy
type: Named individual
type: ConceptScheme
has top concept: Provençal

IANA subtag
comment: Used in BCP47 recommendation for the subtag of a language, script, region or variant

Provençal
type: Concept
type: Variant
type: Named individual
note: Occitan variant spoken in Provence
in scheme: Variant Taxonomy
top concept of: Variant Taxonomy
prefix: oc
issued: 2018-04-22
IANA subtag: provenc

Named individual
type: Class

Variant
type: Class