age-bracket detection
type: Concept
broader: information extraction
definition: the task/process of identifying in a text a segment inside parentheses that describes an age group or age-related utterance
definition: η διαδικασία εντοπισμού μέσα σε ένα κείμενο, ενός αποσπάσματος σε παρένθεση, το οποίο περιγράφει μια ηλικιακή ομάδα ή ένα εκφώνημα σχετικό με τη ηλικία @el
in scheme: CLARIN:EL Dictionary
preferred label: ανίχνευση ηλικιακού εύρους @el

information extraction
type: Concept
narrower: age-bracket detection
preferred label: εξαγωγή πληροφορίας @el

CLARIN:EL Dictionary
type: ConceptScheme
preferred label: Λεξικό CLARIN:EL @el