annotation of document structure
type: Concept
alternative label: tagging of document structure
broader: structural annotation
definition: the task/process of annotating the internal structure of a document (e.g. book chapters, sections in a journal article, title, preface, images/figures etc.)
definition: η διαδικασία επισημείωσης της εσωτερικής δομής ενός εγγράφου (π.χ. κεφάλαια βιβλίου, άρθρα εφημερίδας, τίτλος, εισαγωγικό σημείωμα, εικόνες/σχήματα κτλ.) @el
in scheme: CLARIN:EL Dictionary
preferred label: δομική επισημείωση εγγράφου @el

CLARIN:EL Dictionary
type: ConceptScheme
preferred label: Λεξικό CLARIN:EL @el

structural annotation
type: Concept
narrower: annotation of document structure
preferred label: δομική επισημείωση @el