annotation of multi-word units
type: Concept
broader: morphological annotation
definition: the task/process of annotating multi-word units, i.e. combinations of words that are considered as one
definition: η διαδικασία επισημείωσης πολυλεκτικών μονάδων, π.χ. συνδυασμοί λέξεων που θεωρούνται μία λέξη @el
in scheme: CLARIN:EL Dictionary
preferred label: επισημείωση πολυλεκτικών μονάδων @el

CLARIN:EL Dictionary
type: ConceptScheme
preferred label: Λεξικό CLARIN:EL @el

morphological annotation
type: Concept
narrower: annotation of multi-word units
preferred label: μορφολογική επισημείωση @el