annotation of textual entailment
type: Concept
broader: semantic annotation
definition: the task/process of annotating textual entailments, most usually indicating whether a text entails or contradicts a hypothesis sentence or does neither
definition: η διαδικασίας επισημείωσης κειμενικών συνεπαγωγών, συνήθως με σκοπό να προσδιοριστεί εάν ένα κείμενο επιβεβαιώνει ή διαψεύδει μια υποθετική πρόταση ή τίποτα από τα δύο @el
in scheme: CLARIN:EL Dictionary
preferred label: επισημείωση κειμενικής συνεπαγωγής @el

CLARIN:EL Dictionary
type: ConceptScheme
preferred label: Λεξικό CLARIN:EL @el

semantic annotation
type: Concept
narrower: annotation of textual entailment
preferred label: σημασιολογική επισημείωση @el