κατάτμηση ηχητικών δεδομένων
type: Concept
alternative label: τεμαχισμός ηχητικών δεδομένων
broader: επισημείωση ομιλίας
definition: the task/process of partitioning audio stream into homogeneous segments and classifying them into speech and non-speech segments @en
definition: η διαδικασία τεμαχισμού ηχητικών δεδομένων σε ομοιογενή αποσπάσματα και η κατηγοριοποίησή τους σε αποσμάσματα ομιλίας και αποσπάσματα χωρίς ομιλία
in scheme: Λεξικό CLARIN:EL
preferred label: audio segmentation @en

Λεξικό CLARIN:EL
type: ConceptScheme
preferred label: CLARIN:EL Dictionary @en

επισημείωση ομιλίας
type: Concept
narrower: κατάτμηση ηχητικών δεδομένων
preferred label: speech annotation @en