automatic subtitling
type: Concept
broader: natural language generation
definition: the task/process of automatically adding subtitles to a video
definition: η διαδικασία αυτόματης προσθήκης υπότιτλων σε ένα βίντεο @el
in scheme: CLARIN:EL Dictionary
preferred label: αυτόματος υποτιτλισμός @el

CLARIN:EL Dictionary
type: ConceptScheme
preferred label: Λεξικό CLARIN:EL @el

natural language generation
type: Concept
narrower: automatic subtitling
preferred label: παραγωγή φυσικής γλώσσας @el