definition source
comment: Formal citation, e.g. identifier in external database to indicate / attribute source(s) for the definition. Free text indicate / attribute source(s) for the definition. EXAMPLE: Author Name, URI, MeSH Term C04, PUBMED ID, Wiki uri on 31.01.2007
label: πηγή ορισμού @el

avatar synthesis
type: Concept
definition source: https://www.samsungnext.com/blog/5-companies-at-the-forefront-of-avatar-synthesis
broader: human computer interaction
definition: the creation of avatars (life-like virtual personas) using artificial intelligence (AI), machine learning, and computer vision
definition: η δημιουργία άβαταρ (εικονικών προσώπων που μοιάζουν με πραγματικά) με τη χρήση μεθόδων τεχνητής νοημοσύνης, μηχανικής μάθησης και υπολογιστικής όρασης @el
in scheme: CLARIN:EL Dictionary
note: Avatar synthesis is the creation of avatars using artificial intelligence (AI), machine learning, and computer vision. This technology enables the creation of life-like virtual personas for digital use, either as representations of real people or as embodied AI.
note: Η σύνθεση άβαταρ (ειδώλων) είναι η δημιουργία τους με τη χρήση της τεχνητής νοημοσύνης, της μηχανικής μάθησης και της μηχανικής όρασης. Η τεχνολογία αυτή δίνει τη δυνατότητα δημιουργίας ρεαλιστικών εικονικών χαρακτήρων για ψηφιακή χρήση, είτε ως αναπαραστάσεις πραγματικών προσώπων, είτε ως ενσώματη τεχνητή νοημοσύνη. @el
preferred label: σύνθεση άβαταρ @el

human computer interaction
type: Concept
narrower: avatar synthesis
preferred label: επικοινωνία ανθρώπου-μηχανής @el

CLARIN:EL Dictionary
type: ConceptScheme
preferred label: Λεξικό CLARIN:EL @el