definition source
comment: Formal citation, e.g. identifier in external database to indicate / attribute source(s) for the definition. Free text indicate / attribute source(s) for the definition. EXAMPLE: Author Name, URI, MeSH Term C04, PUBMED ID, Wiki uri on 31.01.2007
label: πηγή ορισμού @el

biomedical concept normalization
type: Concept
definition source: https://www.sciencedirect.com/science/article/pii/S1532046418301126
alternative label: biomedical concept normalisation
broader: concept normalization
definition: the task of mapping free-form expressions to medical terms
definition: η αντιστοίχιση εκφράσεων ελεύθερης μορφής με ιατρικούς όρους @el
in scheme: CLARIN:EL Dictionary
preferred label: κανονικοποίηση βιοιατρικών εννοιών @el

concept normalization
type: Concept
narrower: biomedical concept normalization
preferred label: εννοιολογική κανονικοποίηση @el

CLARIN:EL Dictionary
type: ConceptScheme
preferred label: Λεξικό CLARIN:EL @el