bot detection
type: Concept
broader: information extraction
definition: the task/process of identifying segments of text or speech discourse that have been uttered by bots
definition: η διαδικασία αναγνώρισης αποσπασμάτων γραπτού κειμένου ή προφορικού λόγου που έχουν παραχθεί ή εκφωνηθεί από ρομπότ @el
in scheme: CLARIN:EL Dictionary
preferred label: ανίχνευση μποτ @el

information extraction
type: Concept
narrower: bot detection
preferred label: εξαγωγή πληροφορίας @el

CLARIN:EL Dictionary
type: ConceptScheme
preferred label: Λεξικό CLARIN:EL @el