computational lexicon
type: Concept
source: portal
broader: language resources and technology infrastructure concept
definition: a lexicon which is intended for computational purposes and thus contains words associated with information relevant for the specific purposes
definition: λεξικό που προορίζεται για υπολογιστικούς σκοπούς και, κατά συνέπεια, περιέχει λέξεις που σχετίζονται με πληροφορίες σχετικές με τους συγκεκριμένους σκοπούς @el
in scheme: CLARIN:EL Dictionary
preferred label: υπολογιστικό λεξικό @el

language resources and technology infrastructure concept
type: Concept
narrower: computational lexicon
preferred label: έννοια για υποδομές γλωσσικών πόρων και γλωσσικής τεχνολογίας @el

CLARIN:EL Dictionary
type: ConceptScheme
preferred label: Λεξικό CLARIN:EL @el