data splitting
type: Concept
broader: support operation
definition: the task/process of splitting (partitioning) available data into parts, usually for cross-validatory purposes, e.g. in order to use one part for training purposes and the other for evaluation
definition: η διαδικασία της τμηματοποίησης (τεμαχισμού) των διαθέσιμων δεδομένων σε μέρη, συνήθως για σκοπούς διασταυρωμένης επικύρωσης, π.χ. με σκοπό να χρησιμοποιηθεί το ένα τμήμα για εκπαίδευση και το άλλο για αξιολόγηση @el
in scheme: CLARIN:EL Dictionary
preferred label: διαχωρισμός δεδομένων @el

CLARIN:EL Dictionary
type: ConceptScheme
preferred label: Λεξικό CLARIN:EL @el

support operation
type: Concept
narrower: data splitting
preferred label: λειτουργία υποστήριξης @el