definition source
comment: Formal citation, e.g. identifier in external database to indicate / attribute source(s) for the definition. Free text indicate / attribute source(s) for the definition. EXAMPLE: Author Name, URI, MeSH Term C04, PUBMED ID, Wiki uri on 31.01.2007
label: πηγή ορισμού @el

deep parsing
type: Concept
definition source: adapted from https://stackoverflow.com/questions/37020577/shallow-parsing-vs-deep-parsing-in-stanford-corenlp-java
broader: parsing
definition: the task/process of building complete parse trees for a sentence
definition: η διαδικασία της κατασκευής ολοκληρωμένου συντακτικού δενδροδιαγράμματος για μία πρόταση @el
in scheme: CLARIN:EL Dictionary
preferred label: βαθιά συντακτική ανάλυση @el

CLARIN:EL Dictionary
type: ConceptScheme
preferred label: Λεξικό CLARIN:EL @el

parsing
type: Concept
narrower: deep parsing
preferred label: ανάλυση @el