dictionary
type: Concept
source: portal
broader: language resources and technology infrastructure concept
definition: a book or electronic resource that contains a list of words (usually in alphabetical order) and explains their meanings, or gives a word for them in another language and other information (e.g., spelling, pronunciation, etc.)
definition: βιβλίο ή ηλεκτρονικός πόρος που περιέχει κατάλογο λέξεων (συνήθως με αλφαβητική σειρά) και εξηγεί τη σημασία τους ή δίνει τη λέξη που αντιστοιχεί σε άλλη γλώσσα και άλλες πληροφορίες (π.χ. ορθογραφία, προφορά κτλ.) @el
in scheme: CLARIN:EL Dictionary
preferred label: λεξικό @el

language resources and technology infrastructure concept
type: Concept
narrower: dictionary
preferred label: έννοια για υποδομές γλωσσικών πόρων και γλωσσικής τεχνολογίας @el

CLARIN:EL Dictionary
type: ConceptScheme
preferred label: Λεξικό CLARIN:EL @el