definition source
comment: Formal citation, e.g. identifier in external database to indicate / attribute source(s) for the definition. Free text indicate / attribute source(s) for the definition. EXAMPLE: Author Name, URI, MeSH Term C04, PUBMED ID, Wiki uri on 31.01.2007
label: πηγή ορισμού @el

discourse analysis
type: Concept
definition source: OED, https://en.oxforddictionaries.com/definition/discourse_analysis
source: Γεωργακοπούλου, Α., & Γούτσος, Δ. (2015). Κείμενο και Επικοινωνία. Αθήνα: Εκδόσεις Πατάκη.
alternative label: ανάλυση συνεχούς λόγου @el
broader: linguistic analysis
definition: μέθοδος ανάλυσης της δομής των κειμένων ή των εκφωνημάτων μεγάλυτερων από μία πρόταση, λαμβάνοντας υπόψη τόσο το γλωσσολογικό τους περιεχόμενο όσο και το κοινωνιογλωσσολογικό @el
definition: a method of analysing the structure of texts or utterances longer than one sentence, taking into account both their linguistic content and their sociolinguistic context; analysis performed using this method
in scheme: CLARIN:EL Dictionary
preferred label: ανάλυση λόγου @el

linguistic analysis
type: Concept
narrower: discourse analysis
preferred label: γλωσσολογική ανάλυση @el

CLARIN:EL Dictionary
type: ConceptScheme
preferred label: Λεξικό CLARIN:EL @el