editing
type: Concept
broader: support operation
definition: the task/process of changing the contents of a resource
in scheme: CLARIN:EL Dictionary
preferred label: επεξεργασία @el

CLARIN:EL Dictionary
type: ConceptScheme
preferred label: Λεξικό CLARIN:EL @el

support operation
type: Concept
narrower: editing
preferred label: λειτουργία υποστήριξης @el