entity mention recognition
type: Concept
alternative label: entity mention detection
alternative label: mention detection
broader: information extraction
definition: η διαδικασία ανίχνευσης σε ένα κείμενο αναφορών σε μια συγκεκριμένη τάξη οντοτήτων (π.χ. βιοχημικές οντότητες, ιστορικά πρόσωπα) @el
definition: the task/process of detecting in a text mentions of a specific class of entities (e.g. biochemical entities, historical persons)
in scheme: CLARIN:EL Dictionary
preferred label: αναγνώριση αναφοράς οντοτήτων @el
related: named entity recognition

information extraction
type: Concept
narrower: entity mention recognition
preferred label: εξαγωγή πληροφορίας @el

CLARIN:EL Dictionary
type: ConceptScheme
preferred label: Λεξικό CLARIN:EL @el

named entity recognition
type: Concept
preferred label: αναγνώριση ονοματικών οντοτήτων @el