εντοπισμός συμβάντων
type: Concept
alternative label: αναγνώριση γεγονότων
alternative label: εντοπισμός γεγονότων
alternative label: event extraction @en
broader: εξαγωγή πληροφορίας
definition: the task/process of identifying events in data (text, video, images etc.), usually combined with their classification into types of events and recognition of the event attributes (e.g. time, place, participants and duration) @en
definition: η διαδικασία αναγνώρισης συμβάντων σε δεδομένα (κείμενα, βίντεο, εικόνες κ.α.), συνήθως συνδυασμένη με την κατηγοριοποίηση σε είδη συμβάντων και την αναγνώριση των γνωρισμάτων των συμβάντων αυτών (π.χ. χρόνος, τόπος, συμμετέχοντες και διάρκεια)
in scheme: Λεξικό CLARIN:EL
preferred label: event detection @en

εξαγωγή πληροφορίας
type: Concept
narrower: εντοπισμός συμβάντων
preferred label: information extraction @en

Λεξικό CLARIN:EL
type: ConceptScheme
preferred label: CLARIN:EL Dictionary @en