face detection
type: Concept
broader: operation with multimedia input or output
definition: the task/process of recognizing that a person appears on a digital image or a video frame from a video source and possibly marking the contours around it
definition: η διαδικασία της αναγνώρισης ενός προσώπου που εμφανίζεται σε μια ψηφιακή είκονα ή πλάνο από μία πηγή βίντεο και της επισημείωσης των περιγραμμάτων γύρω από αυτό @el
in scheme: CLARIN:EL Dictionary
preferred label: ανίχνευση προσώπου @el

CLARIN:EL Dictionary
type: ConceptScheme
preferred label: Λεξικό CLARIN:EL @el

operation with multimedia input or output
type: Concept
narrower: face detection
preferred label: λειτουργία με είσοδο ή έξοδο πολυμέσων @el