definition source
comment: Formal citation, e.g. identifier in external database to indicate / attribute source(s) for the definition. Free text indicate / attribute source(s) for the definition. EXAMPLE: Author Name, URI, MeSH Term C04, PUBMED ID, Wiki uri on 31.01.2007
label: πηγή ορισμού @el

feature extraction
type: Concept
definition source: http://scikit-learn.org/stable/modules/feature_extraction.html
broader: support operation
definition: feature extraction consists in transforming arbitrary data, such as text or images, into numerical features usable for machine learning
definition: η εξαγωγή χαρακτηριστικών συνίσταται στη μετατροπή αυθαίρετων δεδομένων, όπως κείμενο ή εικόνες, σε αριθμητικά στοιχεία που μπορούν να χρησιμοποιηθούν στην μηχανική μάθηση @el
in scheme: CLARIN:EL Dictionary
narrower: frequency count
preferred label: εξαγωγή χαρακτηριστικών @el

frequency count
type: Concept
broader: feature extraction
preferred label: μέτρηση συχνότητας @el

CLARIN:EL Dictionary
type: ConceptScheme
preferred label: Λεξικό CLARIN:EL @el

support operation
type: Concept
narrower: feature extraction
preferred label: λειτουργία υποστήριξης @el