definition source
comment: Formal citation, e.g. identifier in external database to indicate / attribute source(s) for the definition. Free text indicate / attribute source(s) for the definition. EXAMPLE: Author Name, URI, MeSH Term C04, PUBMED ID, Wiki uri on 31.01.2007
label: πηγή ορισμού @el

hate speech recognition
type: Concept
definition source: adapted from Wikipedia
alternative label: hate speech detection
broader: information extraction
definition: η αυτόματη αναγνώριση ρητορικής μίσους π.χ. ισχυρισμοί που έχουν ως στόχο να εξευτελίσουν και να εξαγριώσουν κάποιον, χρήση σκληρής και υποτιμητικής γλώσσας στα πλαίσια μιας πραγματικής ή υποτιθέμενης συμμετοχής σε μια κοινωνική ομάδα @el
definition: the task of automatically identifying hate speech, i.e. statements intended to demean and brutalize another, or the use of cruel and derogatory language on the basis of real or alleged membership in a social group
in scheme: CLARIN:EL Dictionary
preferred label: ανίχνευση ρητορικής μίσους @el

information extraction
type: Concept
narrower: hate speech recognition
preferred label: εξαγωγή πληροφορίας @el

CLARIN:EL Dictionary
type: ConceptScheme
preferred label: Λεξικό CLARIN:EL @el