information extraction
type: Concept
narrower: keyword extraction
preferred label: εξαγωγή πληροφορίας @el

keyword extraction
type: Concept
source: Goutsos, D., & Fragkaki, G. (2015). Εισαγωγή στη γλωσσολογία σωμάτων κειμένων [Undergraduate textbook]. Kallipos, Open Academic Editions. http://hdl.handle.net/11419/1932
alternative label: αναζήτηση λέξης-κλειδιού @el
alternative label: keyword search
alternative label: εντοπισμός λέξης-κλειδιού @el
alternative label: εξαγωγή φράσης-κλειδιού @el
alternative label: KWS
alternative label: key phrase extraction
alternative label: keyword spotting
broader: information extraction
definition: the task/process of identifying keywords (words deemed indicative of the topic/subject) in a text/corpus
definition: η διαδικασία αναγνώρισης λέξεων-κλειδιών (λέξεων που θεωρούνται ενδεικτικές για το θέμα) σε ένα κείμενο/σώμα κειμένων @el
in scheme: CLARIN:EL Dictionary
preferred label: εξαγωγή λέξης-κλειδιού @el

CLARIN:EL Dictionary
type: ConceptScheme
preferred label: Λεξικό CLARIN:EL @el