lexicon merging
type: Concept
broader: support operation for knowledge resources
definition: the task/process of merging (combining together) information coming from various lexical/conceptual resources
definition: η διαδικασία της συγχώνευσης (συνδυασμού) πληροφορίας που προέρχεται από διαφορετικούς λεξικούς/εννοιολογικούς πόρους @el
in scheme: CLARIN:EL Dictionary
preferred label: συγχώνευση λεξικού @el

CLARIN:EL Dictionary
type: ConceptScheme
preferred label: Λεξικό CLARIN:EL @el

support operation for knowledge resources
type: Concept
narrower: lexicon merging
preferred label: λειτουργία υποστήριξης πόρων γνώσης @el