lexicon visualization
type: Concept
alternative label: lexicon visualisation
broader: support operation for knowledge resources
broader: visualization
definition: the task/process of visualizing information (e.g. using diagrams, 3-d images, word clouds etc.) contained in lexical/conceptual resources
definition: η διαδικασία της οπτικοποίησης της πληροφορίας που εμπεριέχεται σε λεξικούς ή εννοιολογικούς πόρους (π.χ. με τη χρήση διαγραμμάτων, τρισδιάστατων εικόνων, συννεφόλεξων κτλ.) @el
in scheme: CLARIN:EL Dictionary
preferred label: οπτικοποίηση λεξικού @el

CLARIN:EL Dictionary
type: ConceptScheme
preferred label: Λεξικό CLARIN:EL @el

support operation for knowledge resources
type: Concept
narrower: lexicon visualization
preferred label: λειτουργία υποστήριξης πόρων γνώσης @el

visualization
type: Concept
narrower: lexicon visualization
preferred label: οπτικοποίηση @el