έννοια για υποδομές γλωσσικών πόρων και γλωσσικής τεχνολογίας
type: Concept
narrower: λεξικό αναγνώσιμο από μηχανή
preferred label: language resources and technology infrastructure concept @en

Λεξικό CLARIN:EL
type: ConceptScheme
preferred label: CLARIN:EL Dictionary @en

λεξικό αναγνώσιμο από μηχανή
type: Concept
source: portal
alternative label: μηχαναγνώσιμο λεξικό
broader: έννοια για υποδομές γλωσσικών πόρων και γλωσσικής τεχνολογίας
definition: a dictionary usually meant for humans in a form that a computer can process @en
definition: λεξικό που προορίζεται συνήθως για ανθρώπους σε μορφή που μπορεί να επεξεργαστεί ένας υπολογιστής
in scheme: Λεξικό CLARIN:EL
preferred label: machine readable dictionary @en