linguistic analysis
type: Concept
narrower: morphological analysis
preferred label: γλωσσολογική ανάλυση @el

CLARIN:EL Dictionary
type: ConceptScheme
preferred label: Λεξικό CLARIN:EL @el

morphological analysis
type: Concept
alternative label: general morphological analyisis
broader: linguistic analysis
definition: η ανάλυση της δομής των λέξεων και των σχέσεών τους με άλλες λέξεις αναφορικά με την μορφή και την προέλευσή τους @el
definition: the analysis of the structure of words and their relations to other words as regards their form and derivation
in scheme: CLARIN:EL Dictionary
note: The technologies for or the process of tracing the inflectional, derivational, and compounding processes in the formation of a given word in order to determine properties such as stem form, part-of-speech and inflectional information. As a crucial preprocessing step, morphological analysis is used in virtually all fields of natural language processing.
note: Οι τεχνολογίες και η διαδικασία της ανίχνευσης των κλιτικών, παραγωγικών και συνθετικών διεργασιών στον σχηματισμό μιας λέξης, με σκοπό να διαπιστωθούν ιδιότητες όπως η ρίζα της λέξης, σε ποιο μέρος του λόγου ανήκει και πληροφορίες σχετικά με την κλίση της. Ως βασικότατο προπαρασκευαστικό βήμα, η μορφολογική ανάλυση χρησιμοποιείται σε όλους τους τομείς της επεξεργασίας φυσικής γλώσσας. @el
preferred label: μορφολογική ανάλυση @el