language resources and technology infrastructure concept
type: Concept
narrower: morphological lexicon
preferred label: έννοια για υποδομές γλωσσικών πόρων και γλωσσικής τεχνολογίας @el

CLARIN:EL Dictionary
type: ConceptScheme
preferred label: Λεξικό CLARIN:EL @el

morphological lexicon
type: Concept
source: portal
broader: language resources and technology infrastructure concept
definition: a lexicon with morphological information associated with its entries
definition: λεξικό στο οποίο τα λήμματα συνοδεύονται από μορφολογική πληροφορία @el
in scheme: CLARIN:EL Dictionary
preferred label: μορφολογικό λεξικό @el