CLARIN:EL Dictionary
type: ConceptScheme
preferred label: Λεξικό CLARIN:EL @el

multimodal integration
type: Concept
alternative label: multisensory integration
alternative label: modality integration
broader: operation with multimedia input or output
definition: the study of how information from the different sensory modalities, such as sight, sound, touch, smell, self-motion and taste, may be integrated by the nervous system
in scheme: CLARIN:EL Dictionary
note: Multimodal fusion combines the output of speech understanding, gestures and mimic recognition (if available) to an uniform representation of the user intention.
preferred label: πολυτροπική ενσωμάτωση @el

operation with multimedia input or output
type: Concept
narrower: multimodal integration
preferred label: λειτουργία με είσοδο ή έξοδο πολυμέσων @el