knowledge acquisition
type: Concept
narrower: ontology acquisition
preferred label: απόκτηση γνώσης @el

CLARIN:EL Dictionary
type: ConceptScheme
preferred label: Λεξικό CLARIN:EL @el

ontology acquisition
type: Concept
broader: knowledge acquisition
definition: the task/process of creating an ontology based on other resources (corpora, other lexical resources, etc.)
in scheme: CLARIN:EL Dictionary
preferred label: πρόσκτηση οντολογίας @el