CLARIN:EL Dictionary
type: ConceptScheme
preferred label: Λεξικό CLARIN:EL @el

orthographic transcription
type: Concept
broader: transcription
definition: the task/process of transcribing a source language word/phrase or an audio segment into the standard spelling system of a target language
in scheme: CLARIN:EL Dictionary
preferred label: ορθογραφική μεταγραφή @el

transcription
type: Concept
narrower: orthographic transcription
preferred label: μεταγραφή @el