CLARIN:EL Dictionary
type: ConceptScheme
preferred label: Λεξικό CLARIN:EL @el

machine translation support
type: Concept
narrower: parallel sentence extraction
preferred label: υποστήριξη μηχανικής μετάφρασης @el

parallel sentence extraction
type: Concept
broader: machine translation support
definition: the task/process of identifying parallel sentences (i.e. sentences that have the same sense in different languages) in parallel texts
in scheme: CLARIN:EL Dictionary
preferred label: εξαγωγή παράλληλων προτάσεων @el