information extraction
type: Concept
narrower: persuasive expression mining
preferred label: εξαγωγή πληροφορίας @el

CLARIN:EL Dictionary
type: ConceptScheme
preferred label: Λεξικό CLARIN:EL @el

persuasive expression mining
type: Concept
broader: information extraction
definition: the task/process of identifying and extracting (especially from political speech texts) pieces of text that aim to persuade
in scheme: CLARIN:EL Dictionary
preferred label: εξόρυξη εκφράσεων πειθούς @el