CLARIN:EL Dictionary
type: ConceptScheme
preferred label: Λεξικό CLARIN:EL @el

pseudonymization
type: Concept
alternative label: pseudo-anonymisation
alternative label: pseudonymisation
alternative label: pseudo-anonymization
broader: support operation
definition: the processing of personal data in such a way that the data can no longer be attributed to a specific data subject without the use of additional information (from GDPR)
in scheme: CLARIN:EL Dictionary
preferred label: ψευδο-ανωνυμοποίηση @el

support operation
type: Concept
narrower: pseudonymization
preferred label: λειτουργία υποστήριξης @el