CLARIN:EL Dictionary
type: ConceptScheme
preferred label: Λεξικό CLARIN:EL @el

semantic annotation
type: Concept
narrower: semantic class labelling
preferred label: σημασιολογική επισημείωση @el

semantic class labelling
type: Concept
alternative label: semantic class tagging
alternative label: semantic class labeling
alternative label: semantic class annotation
broader: semantic annotation
definition: the task/process of classifying words in a text according to a set of semantic classes (types)
in scheme: CLARIN:EL Dictionary
preferred label: επισημείωση σημασιολογικών κλάσεων @el