building of finite state automata
type: Concept
definition: the task/process of creating Finite State Automata (a mathematical model of computation)
related: finiteStateTechnology
preferred label: κατασκευή αυτομάτων πεπερασμένης κατάστασης @el
in scheme: CLARIN:EL Dictionary
broader: support operation

CLARIN:EL Dictionary
type: ConceptScheme
preferred label: Λεξικό CLARIN:EL @el

support operation
type: Concept
preferred label: λειτουργία υποστήριξης @el
narrower: building of finite state automata