data masking
type: Concept
definition source: adapted from Wikipedia
definition: the process of hiding original data with modified content (characters or other data) in order to protect data classified as personal identifiable data, or sensitive data
definition: η διαδικασία της απόκρυψης πρωτότυπων δεδομένων και της αντικατάστασής τους με τροποποιημένο περιεχόμενο (χαρακτήρες ή άλλα δεδομένα) με σκοπό την προστασία δεδομένων που έχουν κατηγοριοποιηθεί ως προσωπικά δεδομένα ή δεδομένα με ευαίσθητο περιεχόμενο @el
preferred label: απόκρυψη δεδομένων @el
in scheme: CLARIN:EL Dictionary
broader: anonymization

CLARIN:EL Dictionary
type: ConceptScheme
preferred label: Λεξικό CLARIN:EL @el

anonymization
type: Concept
preferred label: ανωνυμοποίηση @el
narrower: data masking

definition source
comment: Formal citation, e.g. identifier in external database to indicate / attribute source(s) for the definition. Free text indicate / attribute source(s) for the definition. EXAMPLE: Author Name, URI, MeSH Term C04, PUBMED ID, Wiki uri on 31.01.2007
label: πηγή ορισμού @el