data merging
type: Concept
definition: the task/process of merging (combining) together data from various sources
definition: η διαδικασία της συγχώνευσης (συνδυασμού) δεδομένων από διαφορετικές πηγές @el
preferred label: συγχώνευση δεδομένων @el
in scheme: CLARIN:EL Dictionary
broader: support operation

CLARIN:EL Dictionary
type: ConceptScheme
preferred label: Λεξικό CLARIN:EL @el

support operation
type: Concept
preferred label: λειτουργία υποστήριξης @el
narrower: data merging