Λεξικό CLARIN:EL
type: ConceptScheme
preferred label: CLARIN:EL Dictionary @en

διαχωρισμός δεδομένων
type: Concept
definition: the task/process of splitting (partitioning) available data into parts, usually for cross-validatory purposes, e.g. in order to use one part for training purposes and the other for evaluation @en
definition: η διαδικασία της τμηματοποίησης (τεμαχισμού) των διαθέσιμων δεδομένων σε μέρη, συνήθως για σκοπούς διασταυρωμένης επικύρωσης, π.χ. με σκοπό να χρησιμοποιηθεί το ένα τμήμα για εκπαίδευση και το άλλο για αξιολόγηση
preferred label: data splitting @en
in scheme: Λεξικό CLARIN:EL
broader: λειτουργία υποστήριξης

λειτουργία υποστήριξης
type: Concept
preferred label: support operation @en
narrower: διαχωρισμός δεδομένων