αποσφαλμάτωση
type: Concept
preferred label: debugging @en
πηγή ορισμού: https://el.wikipedia.org/wiki/%CE%91%CF%80%CE%BF%CF%83%CF%86%CE%B1%CE%BB%CE%BC%CE%AC%CF%84%CF%89%CF%83%CE%B7
in scheme: Λεξικό CLARIN:EL
definition: the task/process of removing errors from a computer programme @en
definition: η διαδικασία αφαίρεσης σφαλμάτων από ένα πρόγραμμα υπολογιστή
broader: λειτουργία υποστήριξης
note: Στην επιστήμη υπολογιστών και στην ηλεκτρονική, αποσφαλμάτωση ή εκσφαλμάτωση ονομάζεται η μεθοδική διαδικασία εύρεσης και εξάλειψης σφαλμάτων κώδικα ενός προγράμματος υπολογιστή ή ελαττωμάτων ενός ηλεκτρονικού κυκλώματος, ώστε να συμπεριφέρεται όπως προβλέπεται. Η αποσφαλμάτωση τείνει να είναι δυσκολότερη όταν τα διάφορα υποσυστήματα είναι στενά συνδεδεμένα (tightly coupled), καθώς αλλαγές - διορθώσεις στο ένα μπορεί να είναι αιτία εμφάνισης σφαλμάτων σε ένα άλλο.
alternative label: εκσφαλμάτωση

Λεξικό CLARIN:EL
type: ConceptScheme
preferred label: CLARIN:EL Dictionary @en

λειτουργία υποστήριξης
type: Concept
preferred label: support operation @en
narrower: αποσφαλμάτωση

πηγή ορισμού
comment: Formal citation, e.g. identifier in external database to indicate / attribute source(s) for the definition. Free text indicate / attribute source(s) for the definition. EXAMPLE: Author Name, URI, MeSH Term C04, PUBMED ID, Wiki uri on 31.01.2007 @en
label: definition source @en