entity linking
type: Concept
definition: the task/process of attaching tags to all the mentions of an entity in a text linking them together with the entity
definition: η διαδικασία της προσθήκης ετικετών σε όλες τις αναφορές που γίνονται σε ένα κείμενο για μία συγκεκριμένη οντότητα και η σύνδεση όλων αυτών με την οντότητα @el
preferred label: σύνδεση οντοτήτων @el
in scheme: CLARIN:EL Dictionary
broader: semantic annotation

CLARIN:EL Dictionary
type: ConceptScheme
preferred label: Λεξικό CLARIN:EL @el

semantic annotation
type: Concept
preferred label: σημασιολογική επισημείωση @el
narrower: entity linking