CLARIN:EL Dictionary
type: ConceptScheme
preferred label: Λεξικό CLARIN:EL @el

semantic annotation
type: Concept
preferred label: σημασιολογική επισημείωση @el
narrower: event labelling

event labelling
type: Concept
preferred label: επισημείωση συμβάντων @el
alternative label: event tagging
alternative label: event annotation
alternative label: event labeling
alternative label: επισημείωση γεγονότων @el
alternative label: annotation of events
in scheme: CLARIN:EL Dictionary
definition: the process/act of marking events and classifying them into types of events in a text
definition: η διαδικασία επισημείωσης συμβάντων και η κατηγοριοποίησή τους σε είδη γεγονότων σε ένα κείμενο @el
broader: semantic annotation