face recognition
type: Concept
definition: η διαδικασία της ταυτοποίησης ή επαλήθευσης ενός προσώπου σε μία ψηφιακή εικόνα ή πλάνο από μία πηγή βίντεο @el
definition: the task/process of identifying or verifying a person from a digital image or a video frame from a video source
preferred label: αναγνώριση προσώπου @el
definition source: adapted from Wikipedia
alternative label: facial recognition
broader: operation with multimedia input or output
in scheme: CLARIN:EL Dictionary

operation with multimedia input or output
type: Concept
preferred label: λειτουργία με είσοδο ή έξοδο πολυμέσων @el
narrower: face recognition

CLARIN:EL Dictionary
type: ConceptScheme
preferred label: Λεξικό CLARIN:EL @el

definition source
comment: Formal citation, e.g. identifier in external database to indicate / attribute source(s) for the definition. Free text indicate / attribute source(s) for the definition. EXAMPLE: Author Name, URI, MeSH Term C04, PUBMED ID, Wiki uri on 31.01.2007
label: πηγή ορισμού @el