definition source
comment: Formal citation, e.g. identifier in external database to indicate / attribute source(s) for the definition. Free text indicate / attribute source(s) for the definition. EXAMPLE: Author Name, URI, MeSH Term C04, PUBMED ID, Wiki uri on 31.01.2007
label: πηγή ορισμού @el

CLARIN:EL Dictionary
type: ConceptScheme
preferred label: Λεξικό CLARIN:EL @el

face verification
type: Concept
broader: operation with multimedia input or output
definition source: adapted from http://www.idiap.ch/~marcel/labs/faceverif.php
definition: η διαδικασία της επαλήθευσης ταυτότητας βάσει της εικόνας ένος προσώπου και η αποδοχή ή απόρριψη του ισχυρισμού ταυτότητας @el
definition: the task/process of validating a claimed identity based on the image of a face, and either accepting or rejecting the identity claim
alternative label: face authentication
in scheme: CLARIN:EL Dictionary
preferred label: επαλήθευση προσώπου @el

operation with multimedia input or output
type: Concept
preferred label: λειτουργία με είσοδο ή έξοδο πολυμέσων @el
narrower: face verification