parsing
type: Concept
preferred label: ανάλυση @el
narrower: frame-semantic parsing

frame-semantic parsing
type: Concept
definition: the task/process of recognising and labelling in a text predicate argument structures and the semantic roles of the constituents, in accordance to the frame semantics theory
definition: η διαδικασία αναγνώρισης και επισημείωσης σε ένα κείμενο δομών ορισμάτων και των σημασιολογικών ρόλων των συστατικών τους στοιχείων, σύμφωνα με την σημασιολογική θεωρία πλαισίου @el
preferred label: σημασιολογική ανάλυση πλαισίου @el
in scheme: CLARIN:EL Dictionary
broader: parsing
broader: semantic annotation

CLARIN:EL Dictionary
type: ConceptScheme
preferred label: Λεξικό CLARIN:EL @el

semantic annotation
type: Concept
preferred label: σημασιολογική επισημείωση @el
narrower: frame-semantic parsing