knowledge acquisition
type: Concept
preferred label: απόκτηση γνώσης @el
narrower: lexicon enhancement

support operation for knowledge resources
type: Concept
preferred label: λειτουργία υποστήριξης πόρων γνώσης @el
narrower: lexicon enhancement

CLARIN:EL Dictionary
type: ConceptScheme
preferred label: Λεξικό CLARIN:EL @el

lexicon enhancement
type: Concept
definition: the task/process of improving (e.g. increasing the size of entries, improving the information, adding new types of information, etc.) a lexicon
definition: η διαδικασία βελτιστοποίησης ενός λεξικού (αύξηση του αριθμού των λημμάτων, βελτιστοποίηση της πληροφορίας, προσθήκη νέου είδους πληροφορίας κτλ.) @el
preferred label: βελτιστοποίηση λεξικού @el
in scheme: CLARIN:EL Dictionary
broader: knowledge acquisition
broader: support operation for knowledge resources