translation
type: Concept
preferred label: μετάφραση @el
narrower: localization

localization
type: Concept
in scheme: CLARIN:EL Dictionary
definition source: adapted from https://www.gala-global.org/industry/intro-language-industry/what-localization
definition: η διαδικασία προσαρμογής ενός προϊόντος ή περιεχομένου σε ένα συγκεκριμένο τόπο ή αγορά, συμπεριλαμβανομένης και της μετάφρασης του σχετικού γλωσσικού υλικού αλλά επίσης και της μετατροπής σε τοπικά μέτρα και νομισματικές μονάδες, των απαραίτητων τροποποιήσεων για την προσαρμογή του στις πολιτισμικές διαφορές του κοινού στο οποίο απευθύνεται @el
definition: the process of adapting a product or content to a specific locale or market, including translation of relevant language material but also converting to local measures and currency units, modifications necessary to adapt to cultural differences of the target audience, etc
alternative label: localisation
preferred label: προσαρμογή @el
broader: translation

CLARIN:EL Dictionary
type: ConceptScheme
preferred label: Λεξικό CLARIN:EL @el

definition source
comment: Formal citation, e.g. identifier in external database to indicate / attribute source(s) for the definition. Free text indicate / attribute source(s) for the definition. EXAMPLE: Author Name, URI, MeSH Term C04, PUBMED ID, Wiki uri on 31.01.2007
label: πηγή ορισμού @el