CLARIN:EL Dictionary
type: ConceptScheme
preferred label: Λεξικό CLARIN:EL @el

language resources and technology infrastructure concept
type: Concept
preferred label: έννοια για υποδομές γλωσσικών πόρων και γλωσσικής τεχνολογίας @el
narrower: manual text annotation

manual text annotation
type: Concept
alternative label: manual text labeling
alternative label: manual text tagging
alternative label: manual text labelling
definition: Η επισημείωση αποτελεί μια διαδικασία επεξεργασίας κειμένων, κατά την οποία προσαρτώνται ετικέτες (tags) σε λέξεις ή/και σύνολα λέξεων ενός κειμένου ή ενός σώματος κειμένων και η οποία μπορεί να γίνει τόσο σε πρωτογενή δεδομένα (raw data) όσο και σε κείμενο που έχει ήδη υποστεί κάποια επεξεργασία (όπως μία πρώτη επισημείωση). Η επισημείωση μπορεί να γίνει αυτόματα [...] αλλά και με το χέρι, από ανθρώπους επισημειωτές. @el
definition: Annotation is the practice of adding interpretative linguistic information, known also as tags and/or labels, to words, or sets of words of a text or a corpus. Annotation can be done both in raw data as well as in data that have already been processed. Annotation can be done automatically [...] or manually, by human annotators.
broader: language resources and technology infrastructure concept
source: documentation
preferred label: χειρωνακτική επισημείωση κειμένων @el
in scheme: CLARIN:EL Dictionary