mapping of resources
type: Concept
source: portal
definition: a resource consisting of mapping values and/or rules between two resources
definition: πόρος που αποτελείται από την αντιστοίχιση τιμών ή/και κανόνων μεταξύ δύο πόρων @el
preferred label: αντιστοίχιση πόρων @el
in scheme: CLARIN:EL Dictionary
broader: language resources and technology infrastructure concept

CLARIN:EL Dictionary
type: ConceptScheme
preferred label: Λεξικό CLARIN:EL @el

language resources and technology infrastructure concept
type: Concept
preferred label: έννοια για υποδομές γλωσσικών πόρων και γλωσσικής τεχνολογίας @el
narrower: mapping of resources